{"text_format":"1","workbook":"xlsx","n_sheets":4,"sheets":["Proceso Judicial","Información Pólizas","Coberturas y Proceso","Intereses"],"not_rendered":{"charts":0,"images":0,"macros":1,"external_links":0,"defined_names":20,"comments":2,"pivot_tables":0},"unopened":[],"bounds":{"document_bytes":16777216,"sheet_cells":100000,"rows_first":2000,"rows_last":500,"rows_between":2000,"halvings":0,"cell_chars":16384,"cell_head_chars":4096},"cells_cut":0,"cells_raw":0,"read":"whole","date_system":"1900"}

{"sheet":"Proceso Judicial","index":0,"n_rows":75,"n_cols":10,"rows_kept":75,"cut":false,"hidden":false,"merged":[]}
[null,null,null,"Concepto","Prob Ramo","Prob sin segmentar"]
[null,null,null,"Valor PML, Pretensión o Sentencia",{"$f":"IF(AND('Proceso Judicial'!$E$38=\"SÍ\",'Proceso Judicial'!$E$45=FALSE),'Proceso Judicial'!$E$39,MIN('Proceso Judicial'!$E$35:$E$36))","v":556665499}]
[null,null,null,"Cumple criterios",{"$f":"IF(AND('Proceso Judicial'!$E$24=\"SÍ\",'Proceso Judicial'!$E$25=\"SÍ\"),\"SÍ\",\"NO\")","v":"SÍ"}]
[null,null,null,"Puntaje cumplimiento",{"$f":"IF($E$3=\"NO\",\"NA\",$E$54)","v":5}]
[null,null,null,"Puntaje tipo del proceso",{"$f":"IF($E$3=\"NO\",\"NA\",'Proceso Judicial'!E55)","v":-1}]
[null,null,null,"Puntaje etapa del proceso",{"$f":"IF($E$3=\"NO\",\"NA\",'Proceso Judicial'!E56)","v":2}]
[null,null,null,"Puntaje territorialidad",{"$f":"IF($E$3=\"NO\",\"NA\",'Proceso Judicial'!E57)","v":-0.5}]
[null,null,null,"Puntaje garantizado y garantías",{"$f":"IF($E$3=\"NO\",\"NA\",SUM('Proceso Judicial'!E58:E59))","v":0}]
{"$rows_left_out":68}
{"sheet":"Información Pólizas","index":1,"n_rows":107,"n_cols":79,"rows_kept":107,"cut":false,"hidden":true,"merged":[]}
[null,"Reserva de siniestros",{"$f":"SUM(Tabla_Pólizas[RESERVA DEL SINIESTRO])","v":{"$error":"#REF!"}}]
[null,"Reserva de honorarios",{"$f":"SUM(Tabla_Pólizas[RESERVA DE HONORARIOS])","v":{"$error":"#REF!"}}]
[null,"Reserva de gastos direct.",{"$f":"SUM(Tabla_Pólizas[RESERVA DE GASTOS DIRECTOS])","v":0}]
[null,"Reserva de gastos indirect.",{"$f":"SUM(Tabla_Pólizas[RESERVA DE GASTOS INDIRECTOS])","v":0}]
[null,"RESERVA TOTAL",{"$f":"SUM(C1:C4)","v":{"$error":"#REF!"}}]
[null,null,null,null,null,null,null,null,null,null,null,null,null,null,null,null,null,null,null,null,null,{"$f":"SUM(Tabla_Pólizas[Porcentaje de distribución de honorarios])","v":0.5},{"$f":"SUM(Tabla_Pólizas[Porcentaje de distribución del pago parcial])","v":0},null,null,null,null,null,null,null,null,null,null,null,null,null,null,null,null,"PML",null,null,null,null,null,"% PÉRDIDA",null,null,null,null,null,"RSA SINIESTRO"]
["NOMBRE ITEM >","Nombre de Tomador","Nombre de Asegurado","Número de Póliza","Número de siniestro","Inicio de vigencia","Fin de vigencia","Ramo SFC","Cobertura","Unid Vlr Asegurado","Vlr Asegurado","SMLMV Fecha Ocurrencia Siniestro","Unid Sublímite","Valor Sublímite ","% Coaseguro de Confianza","Unid Deducible","Deducible","Unid de ejecución del contrato o inversión del anticipo","Ejecución del contrato y/o inversión del anticipo","Unid Conciliación","Valor Conciliación","Porcentaje de distribución de honorarios","Porcentaje de distribución del pago parcial","¿Existe la cobertura reclamada?","¿El siniestro ocurrió dentro de la vigencia?","¿Hay preescripción en este contrato de seguro?","Hay Culpabilidad","Hay Incumplimiento","Llave","CUMPLE CRITERIOS DE RECLAMACIÓN","DISTRIBUCIÓN PRETENSIÓN OTRAS COBERTURAS","VALOR ASEGURADO PESOS","VALOR SIN EJECUTAR","PRETENSIÓN PESOS","VALOR SUBLÍMITE PESOS","VALOR SIN DEDUCIBLE","VALOR DEDUCIBLE","VALOR MÁX PARÁMETROS PÓLIZA","INTERESES","PÉRDIDA MÁXIMA PROBABLE","PUNTAJE CULPABILIDAD","PUNTAJE INCUMPLIMIENTO","PUNTAJE ETAPA DEL PROCESO","PUNTAJE TERRITORIALIDAD","PUNTAJE TOTAL","PROBABILIDAD DE PÉRDIDA","RESERVA BRUTA PRELIMINAR DEL SINIESTRO","PAGOS PARCIALES","RESERVA PRELIMINAR DEL SINIESTRO","VALOR CONCILIACIÓN PESOS","VALOR SENTENCIA PESOS","RESERVA DEL SINIESTRO","RESERVA DE HONORARIOS","RESERVA DE GASTOS DIRECTOS","RESERVA DE GASTOS INDIRECTOS","RESERVA TOTAL",null,null,null,"RAMO SFC",null,null,null,null,"COBERTURA"]
[null,null,null,"06GU010878",11687,null,null,"CUMPLIMIENTO","CUMPLIMIENTO","COP",27000000000,689455,null,null,1,"%",10,"%",0,"COP",0,0.5,null,"SÍ","SÍ","NO","NO","Neutral",{"$f":"Tabla_Pólizas[[#This Row],[Ramo SFC]]&\"-\"&Tabla_Pólizas[[#This Row],[Cobertura]]","v":"CUMPLIMIENTO-CUMPLIMIENTO"},{"$f":"IF(AND(Tabla_Pólizas[[#This Row],[¿Existe la cobertura reclamada?]]=\"SÍ\",Tabla_Pólizas[[#This Row],[¿El siniestro ocurrió dentro de la vigencia?]]=\"SÍ\",Tabla_Pólizas[[#This Row],[¿Hay preescripción en este contrato de seguro?]]=\"NO\"),\"SÍ\",\"NO\")","v":"SÍ"},{"$f":"IF(COUNTA(Tabla_Pólizas[CUMPLE CRITERIOS DE RECLAMACIÓN])=COUNTIF(Tabla_Pólizas[CUMPLE CRITERIOS DE RECLAMACIÓN],\"NO\"),Tabla_Pólizas[[#This Row],[VALOR ASEGURADO PESOS]]/SUM(Tabla_Pólizas[VALOR ASEGURADO PESOS]),IF(Tabla_Pólizas[[#This Row],[CUMPLE CRITERIOS DE RECLAMACIÓN]]=\"NO\",0.5%,(1-(COUNTIF(Tabla_Pólizas[CUMPLE CRITERIOS DE RECLAMACIÓN],\"NO\")*0.5%))*(Tabla_Pólizas[[#This Row],[VALOR ASEGURADO PESOS]]/SUMIF(Tabla_Pólizas[CUMPLE CRITERIOS DE RECLAMACIÓN],\"SÍ\",Tabla_Pólizas[VALOR ASEGURADO PESOS]))))","v":1},{"$f":"IF(Tabla_Pólizas[[#This Row],[Unid Vlr Asegurado]]=\"COP\",Tabla_Pólizas[[#This Row],[Vlr Asegurado]],IF(Tabla_Pólizas[[#This Row],[Unid Vlr Asegurado]]=\"USD\",Tabla_Pólizas[[#This Row],[Vlr Asegurado]]*'Proceso Judicial'!#REF!,Tabla_Pólizas[[#This Row],[Vlr Asegurado]]*Tabla_Pólizas[[#This Row],[SMLMV Fecha Ocurrencia Siniestro]]))","v":27000000000},{"$f":"IF(OR(ISNUMBER(SEARCH(\"cumplimiento\",Tabla_Pólizas[[#This Row],[Ramo SFC]])),ISNUMBER(SEARCH(\"anticipo\",Tabla_Pólizas[[#This Row],[Cobertura]]))),IF(Tabla_Pólizas[[#This Row],[Unid de ejecución del contrato o inversión del anticipo]]=\"%\",Tabla_Pólizas[[#This Row],[VALOR ASEGURADO PESOS]]*(1-(Tabla_Pólizas[[#This Row],[Ejecución del contrato y/o inversión del anticipo]]/100)),Tabla_Pólizas[[#This Row],[VALOR ASEGURADO PESOS]]-Tabla_Pólizas[[#This Row],[Ejecución del contrato y/o inversión del anticipo]]),\"ND\")","v":27000000000},{"$f":"IF('Proceso Judicial'!$E$36=0,\"ND\",'Proceso Judicial'!#REF!*Tabla_Pólizas[[#This Row],[DISTRIBUCIÓN PRETENSIÓN OTRAS COBERTURAS]])","v":{"$error":"#REF!"}},{"$f":"IF(ISNUMBER(SEARCH(\"cumplimiento\",Tabla_Pólizas[[#This Row],[Ramo SFC]])),\"ND\",IF(Tabla_Pólizas[[#This Row],[Valor Sublímite ]]=0,\"ND\",IF(Tabla_Pólizas[[#This Row],[Unid Sublímite]]=\"COP\",Tabla_Pólizas[[#This Row],[Valor Sublímite ]],IF(Tabla_Pólizas[[#This Row],[Unid Sublímite]]=\"%\",Tabla_Pólizas[[#This Row],[VALOR ASEGURADO PESOS]]*Tabla_Pólizas[[#This Row],[Valor Sublímite ]]/100,Tabla_Pólizas[[#This Row],[Valor Sublímite ]]*Tabla_Pólizas[[#This Row],[SMLMV Fecha Ocurrencia Siniestro]]))))","v":"ND"},{"$f":"IF(ISNUMBER(SEARCH(\"cumplimiento\",Tabla_Pólizas[[#This Row],[Ramo SFC]])),MIN(Tabla_Pólizas[[#This Row],[VALOR ASEGURADO PESOS]:[PRETENSIÓN PESOS]]),MIN(Tabla_Pólizas[[#This Row],[VALOR ASEGURADO PESOS]:[VALOR SUBLÍMITE PESOS]]))*Tabla_Pólizas[[#This Row],[% Coaseguro de Confianza]]","v":{"$error":"#REF!"}},{"$f":"IF(ISNUMBER(SEARCH(\"cumplimiento\",Tabla_Pólizas[[#This Row],[Ramo SFC]])),0,IF(Tabla_Pólizas[[#This Row],[Deducible]]=0,0,IF(Tabla_Pólizas[[#This Row],[Unid Deducible]]=\"COP\",Tabla_Pólizas[[#This Row],[Deducible]],IF(Tabla_Pólizas[[#This Row],[Unid Deducible]]=\"SMMLV\",Tabla_Pólizas[[#This Row],[Deducible]]*Tabla_Pólizas[[#This Row],[SMLMV Fecha Ocurrencia Siniestro]],Tabla_Pólizas[[#This Row],[VALOR SIN DEDUCIBLE]]*Tabla_Pólizas[[#This Row],[Deducible]]/100))))","v":0},{"$f":"MAX(Tabla_Pólizas[[#This Row],[VALOR SIN DEDUCIBLE]]-Tabla_Pólizas[[#This Row],[VALOR DEDUCIBLE]],Tabla_Pólizas[[#This Row],[VALOR SIN DEDUCIBLE]]*1.5%)","v":{"$error":"#REF!"}},{"$f":"IF('Proceso Judicial'!$E$73=\"NO\",0,(Tabla_Pólizas[[#This Row],[VALOR MÁX PARÁMETROS PÓLIZA]]*(1+(_xlfn.XLOOKUP('Proceso Judicial'!$E$74,Intereses[Hasta],Intereses[TIB corriente (%EM)],,-1)))^'Proceso Judicial'!$F$74)-Tabla_Pólizas[[#This Row],[VALOR MÁX PARÁMETROS PÓLIZA]])","v":0},{"$f":"IF(AND(Tabla_Pólizas[[#This Row],[¿Existe la cobertura reclamada?]]=\"SÍ\",Tabla_Pólizas[[#This Row],[¿El siniestro ocurrió dentro de la vigencia?]]=\"SÍ\",Tabla_Pólizas[[#This Row],[¿Hay preescripción en este contrato de seguro?]]=\"NO\"),MAX(Tabla_Pólizas[[#This Row],[VALOR MÁX PARÁMETROS PÓLIZA]]+Tabla_Pólizas[[#This Row],[INTERESES]],'Proceso Judicial'!#REF!),MAX((Tabla_Pólizas[[#This Row],[VALOR MÁX PARÁMETROS PÓLIZA]]+Tabla_Pólizas[[#This Row],[INTERESES]])*1.5%,'Proceso Judicial'!#REF!))","v":{"$error":"#REF!"}},{"$f":"IF(ISNUMBER(SEARCH(\"cumplimiento\",Tabla_Pólizas[[#This Row],[Ramo SFC]])),\"ND\",VLOOKUP(Tabla_Pólizas[[#This Row],[Hay Culpabilidad]],#REF!,2,0))","v":"ND"},{"$f":"IF(ISNUMBER(SEARCH(\"cumplimiento\",Tabla_Pólizas[[#This Row],[Ramo SFC]])),VLOOKUP(Tabla_Pólizas[[#This Row],[Hay Incumplimiento]],Tabla_Incumplimiento[],2,0),\"ND\")","v":3},{"$f":"VLOOKUP('Proceso Judicial'!$E$28,OFFSET(INDIRECT('Proceso Judicial'!$E$27),0,0,,6),VLOOKUP(IF(Tabla_Pólizas[[#This Row],[Ramo SFC]]=\"Cumplimiento\",Tabla_Pólizas[[#This Row],[Hay Incumplimiento]],Tabla_Pólizas[[#This Row],[Hay Culpabilidad]]),Tabla_Columnas[],2,0),0)","v":1.2},{"$f":"VLOOKUP('Proceso Judicial'!$E$29,Tabla_territorialidad[],VLOOKUP(IF(ISNUMBER(SEARCH(\"cumplimiento\",Tabla_Pólizas[[#This Row],[Ramo SFC]])),Tabla_Pólizas[[#This Row],[Hay Incumplimiento]],Tabla_Pólizas[[#This Row],[Hay Culpabilidad]]),Tabla_Columnas[],2,0),0)","v":-0.25},{"$f":"MIN(MAX(SUM(Tabla_Pólizas[[#This Row],[PUNTAJE CULPABILIDAD]:[PUNTAJE TERRITORIALIDAD]]),0),10)","v":3.95},{"$f":"VLOOKUP(Tabla_Pólizas[[#This Row],[PUNTAJE TOTAL]],Tabla_Puntaje[],3,1)","v":0.29515184479707379},{"$f":"Tabla_Pólizas[[#This Row],[PÉRDIDA MÁXIMA PROBABLE]]*Tabla_Pólizas[[#This Row],[PROBABILIDAD DE PÉRDIDA]]","v":{"$error":"#REF!"}},{"$f":"IF('Proceso Judicial'!$E$69=\"NO\",0,'Proceso Judicial'!$E$70)*IF('Proceso Judicial'!$E$71=\"Automático\",(Tabla_Pólizas[[#This Row],[RESERVA BRUTA PRELIMINAR DEL SINIESTRO]]/SUM(Tabla_Pólizas[RESERVA BRUTA PRELIMINAR DEL SINIESTRO])),Tabla_Pólizas[[#This Row],[Porcentaje de distribución del pago parcial]])","v":{"$error":"#REF!"}},{"$f":"Tabla_Pólizas[[#This Row],[RESERVA BRUTA PRELIMINAR DEL SINIESTRO]]-Tabla_Pólizas[[#This Row],[PAGOS PARCIALES]]","v":{"$error":"#REF!"}},{"$f":"IF(OR(Tabla_Pólizas[[#This Row],[Valor Conciliación]]=0,NOT(ISNUMBER(Tabla_Pólizas[[#This Row],[Valor Conciliación]]))),\"ND\",IF(Tabla_Pólizas[[#This Row],[Unid Conciliación]]=\"COP\",Tabla_Pólizas[[#This Row],[Valor Conciliación]],Tabla_Pólizas[[#This Row],[Valor Conciliación]]*Tabla_Pólizas[[#This Row],[SMLMV Fecha Ocurrencia Siniestro]]))","v":"ND"},{"$f":"IF('Proceso Judicial'!$E$38=\"NO\",\"ND\",(Tabla_Pólizas[[#This Row],[RESERVA BRUTA PRELIMINAR DEL SINIESTRO]]/SUM(Tabla_Pólizas[RESERVA BRUTA PRELIMINAR DEL SINIESTRO]))*'Proceso Judicial'!#REF!)","v":"ND"},{"$f":"IF('Proceso Judicial'!$E$45=TRUE,Tabla_Pólizas[[#This Row],[VALOR SENTENCIA PESOS]],MAX(Tabla_Pólizas[[#This Row],[RESERVA PRELIMINAR DEL SINIESTRO]:[VALOR SENTENCIA PESOS]]))","v":{"$error":"#REF!"}},{"$f":"IF('Proceso Judicial'!$E$49=\"NO\",_xlfn.XLOOKUP(Tabla_Pólizas[[#This Row],[Llave]],Estructura[LLAVE],Estructura[HONORARIOS],\"ND\"),'Proceso Judicial'!#REF!*IF('Proceso Judicial'!#REF!=\"Automático\",(Tabla_Pólizas[[#This Row],[RESERVA DEL SINIESTRO]]/SUM(Tabla_Pólizas[RESERVA DEL SINIESTRO])),Tabla_Pólizas[[#This Row],[Porcentaje de distribución de honorarios]]))","v":{"$error":"#REF!"}},{"$f":"_xlfn.XLOOKUP(Tabla_Pólizas[[#This Row],[Llave]],Estructura[LLAVE],Estructura[GASTOS DIRECTOS],\"ND\")","v":0},{"$f":"_xlfn.XLOOKUP(Tabla_Pólizas[[#This Row],[Llave]],Estructura[LLAVE],Estructura[GASTOS INDIRECTOS],\"ND\")","v":0},{"$f":"SUM(Tabla_Pólizas[[#This Row],[RESERVA DEL SINIESTRO]:[RESERVA DE GASTOS INDIRECTOS]])","v":{"$error":"#REF!"}},null,null,null,{"$f":"TRANSPOSE(_xlfn.UNIQUE(Estructura[RAMO SFC],FALSE,FALSE))","v":"CUMPLIMIENTO"},"RESPONSABILIDAD CIVIL",null,null,null,{"$f":"TRANSPOSE(_xlfn.UNIQUE(_xlfn._xlws.FILTER(Estructura[COBERTURA],(Estructura[RAMO SFC]=Tabla_Pólizas[[#This Row],[Ramo SFC]])),FALSE,FALSE))","v":"ANTICIPO"},"ART. 513","ART. 599","CALIDAD","CALIDAD DE SERVICIO","CALIDAD DE SUMINISTRO","CAUCION JUDICIAL","CONTRATISTAS Y SUBCONTRATISTAS","CUMPLIMIENTO","DISPOSICIONES LEGALES","ESTABILIDAD DE LA OBRA","OTRAS","PLO","SALARIOS Y PRESTACIONES","SERIEDAD DE LA OFERTA"]
{"$rows_left_out":100}
{"sheet":"Coberturas y Proceso","index":2,"n_rows":38,"n_cols":89,"rows_kept":38,"cut":false,"hidden":true,"merged":[]}
[null,null,null,null,null,null,"RAMO SFC","COBERTURA","LLAVE","HONORARIOS","GASTOS DIRECTOS","GASTOS INDIRECTOS",null,null,null,null,null,null,null,null,null,null,null,null,null,null,null,null,null,null,null,null,null,null,null,null,null,null,null,null,null,null,null,null,null,null,null,null,null,null,null,null,null,null,null,null,null,null,null,null,null,null,null,"ETAPAS Y PUNTAJES DE LOS PROCESOS JUDICIALES - RESPONSABILIDAD FISCAL - JURISDICCIÓN ORDINARIA - CONTENCIOSO ADMINISTRATIVO - TRIBUNAL ARBITRAMENTO",null,null,null,null,null,null,null,null,null,null,null,null,null,"CRITERIOS ANÁLISIS CUALITATIVO DEL PROCESO JUDICIAL"]
["TIPO DE PROCESO JUDICIAL","ÚLTIMA_INSTANCIA_FAVORABLE","SÍ","Neutral","NO",null,"CUMPLIMIENTO","ANTICIPO",{"$f":"Estructura[[#This Row],[RAMO SFC]]&\"-\"&Estructura[[#This Row],[COBERTURA]]","v":"CUMPLIMIENTO-ANTICIPO"},null,null,null,null,"Responsabilidad_Fiscal","SÍ","SÍ con atenuantes","Neutral","NO",null,"Incidente_Reparación","SÍ","Neutral","NO",null,"Proceso_Ejecutivo","SÍ","Neutral","NO",null,"Proceso_Coactivo","SÍ","Neutral","NO",null,"Tribunal_Arbitramento","SÍ","Neutral","NO",null,"Acción_Protección_Consumidor","SÍ","Neutral","NO",null,"Proceso_Contractual","SÍ","Neutral","NO",null,"Proceso_Nulidad","SÍ","Neutral","NO",null,"Reparación_Directa","SÍ","Neutral","NO",null,"Jurisdicción_Ordinaria_Civil","SÍ","Neutral","NO",null,"Jurisdicción_Ordinaria_Laboral","SÍ","Neutral","NO",null,"Calificación","Columna",null,"Perfil_afianzado","Puntaje",null,"Incumplimiento","Puntaje Inicial",null,"Territorialidad","SÍ","Neutral","NO",null,"Puntaje","CLASIFICACIÓN","Cumplimiento","Total",null,"Etapas_condena"]
["Acción_Protección_Consumidor","Resolución",0,0,0,null,"CUMPLIMIENTO","ART. 513",{"$f":"Estructura[[#This Row],[RAMO SFC]]&\"-\"&Estructura[[#This Row],[COBERTURA]]","v":"CUMPLIMIENTO-ART. 513"},null,null,null,null,"Auto de apertura",1.5,1.5,{"$f":"Tabla_Resp_Fiscal[[#This Row],[NO]]*0.6","v":1.2},2,null,"Presentación demanda - contestación",1.5,{"$f":"Tabla_Jurisd_Ord_Laboral[[#This Row],[NO]]*0.6","v":1.2},2,null,"Presentación demanda - contestación",1.5,{"$f":"Tabla_Proces_Coact[[#This Row],[NO]]*0.6","v":1.2},2,null,"Presentación demanda - contestación",1.5,{"$f":"Tabla_Proces_Coact[[#This Row],[NO]]*0.6","v":1.2},2,null,"Contestación demanda -",1.5,{"$f":"Tabla_Proces_Coact[[#This Row],[NO]]*0.6","v":1.2},2,null,"Contestación demanda -",1.5,{"$f":"Tabla_Proces_Coact[[#This Row],[NO]]*0.6","v":1.2},2,null,"Presentación demanda - contestación",1.5,{"$f":"Tabla_Proces_Coact[[#This Row],[NO]]*0.6","v":1.2},2,null,"Presentación demanda - contestación",1.5,{"$f":"Tabla_Proces_Coact[[#This Row],[NO]]*0.6","v":1.2},2,null,"Presentación demanda - contestación",1.5,{"$f":"Tabla_Jurisd_Ord_Laboral[[#This Row],[NO]]*0.6","v":1.2},2,null,"Presentación demanda - contestación",1.5,{"$f":"Tabla_Jurisd_Ord_Laboral[[#This Row],[NO]]*0.6","v":1.2},2,null,"Presentación demanda - contestación",1.5,{"$f":"Tabla_Jurisd_Ord_Laboral[[#This Row],[NO]]*0.6","v":1.2},2,null,"SÍ",2,null,"Muy solvente",1.5,null,"SÍ",0.5,null,"NO APLICA",0,{"$f":"Tabla_territorialidad[[#This Row],[NO]]/2","v":0},0,null,0,"Probable",1,1,null,"Fallo fiscal I - desfavorable"]
["Incidente_Reparación","Sentencia segunda instancia",0.25,0.5,1,null,"CUMPLIMIENTO","ART. 599",{"$f":"Estructura[[#This Row],[RAMO SFC]]&\"-\"&Estructura[[#This Row],[COBERTURA]]","v":"CUMPLIMIENTO-ART. 599"},null,null,null,null,"Auto de imputación - desfavorable",0.5,0.5,0,-1,null,"Sentencia primera instancia - favorable",3,{"$f":"Tabla_Jurisd_Ord_Laboral[[#This Row],[NO]]*0.6","v":1.7999999999999998},3,null,"Sentencia primera instancia - favorable",3,{"$f":"Tabla_Proces_Coact[[#This Row],[NO]]*0.6","v":2.4},4,null,"Sentencia primera instancia - favorable",3,{"$f":"Tabla_Proces_Coact[[#This Row],[NO]]*0.6","v":2.4},4,null,"Laudo arbitral - favorable",3,{"$f":"Tabla_Proces_Coact[[#This Row],[NO]]*0.6","v":2.4},5,null,"Resolución - favorable",3,{"$f":"Tabla_Proces_Coact[[#This Row],[NO]]*0.6","v":2.4},4,null,"Sentencia primera instancia - favorable",3,{"$f":"Tabla_Proces_Coact[[#This Row],[NO]]*0.6","v":2.4},4,null,"Sentencia primera instancia - favorable",3,{"$f":"Tabla_Proces_Coact[[#This Row],[NO]]*0.6","v":2.4},4,null,"Sentencia primera instancia - favorable",3,{"$f":"Tabla_Jurisd_Ord_Laboral[[#This Row],[NO]]*0.6","v":1.7999999999999998},3,null,"Sentencia primera instancia - favorable",3,{"$f":"Tabla_Jurisd_Ord_Laboral[[#This Row],[NO]]*0.6","v":1.7999999999999998},3,null,"Sentencia primera instancia - favorable",3,{"$f":"Tabla_Jurisd_Ord_Laboral[[#This Row],[NO]]*0.6","v":1.7999999999999998},3,null,"Neutral",3,null,"Solvente",0.75,null,"Neutral",3,null,"AMAZONAS",0,{"$f":"Tabla_territorialidad[[#This Row],[NO]]/2","v":-0.5},-1,null,1,"Probable",0.82095421763653631,0.75715413087607097,null,"Fallo fiscal II - desfavorable"]
["Jurisdicción_Ordinaria_Civil","Sentencia segunda instancia",0,0,0,null,"CUMPLIMIENTO","CALIDAD",{"$f":"Estructura[[#This Row],[RAMO SFC]]&\"-\"&Estructura[[#This Row],[COBERTURA]]","v":"CUMPLIMIENTO-CALIDAD"},null,null,null,null,"Fallo fiscal I - favorable",2.5,2.5,{"$f":"Tabla_Resp_Fiscal[[#This Row],[NO]]*0.6","v":2.4},4,null,"Sentencia primera instancia - desfavorable",0,{"$f":"Tabla_Jurisd_Ord_Laboral[[#This Row],[NO]]*0.6","v":-1.7999999999999998},-3,null,"Sentencia primera instancia - desfavorable",0,{"$f":"Tabla_Proces_Coact[[#This Row],[NO]]*0.6","v":-1.2},-2,null,"Sentencia primera instancia - desfavorable",0,{"$f":"Tabla_Proces_Coact[[#This Row],[NO]]*0.6","v":-1.2},-2,null,"Laudo arbitral - desfavorable",0,{"$f":"Tabla_Proces_Coact[[#This Row],[NO]]*0.6","v":-1.2},-5,null,"Resolución - desfavorable",0,{"$f":"Tabla_Proces_Coact[[#This Row],[NO]]*0.6","v":-1.2},-2,null,"Sentencia primera instancia - desfavorable",0,{"$f":"Tabla_Proces_Coact[[#This Row],[NO]]*0.6","v":-1.2},-2,null,"Sentencia primera instancia - desfavorable",0,{"$f":"Tabla_Proces_Coact[[#This Row],[NO]]*0.6","v":-1.2},-2,null,"Sentencia primera instancia - desfavorable",0,{"$f":"Tabla_Jurisd_Ord_Laboral[[#This Row],[NO]]*0.6","v":-1.7999999999999998},-3,null,"Sentencia primera instancia - desfavorable",0,{"$f":"Tabla_Jurisd_Ord_Laboral[[#This Row],[NO]]*0.6","v":-1.7999999999999998},-3,null,"Sentencia primera instancia - desfavorable",0,-1,-3,null,"NO",4,null,"Normal",0,null,"NO",5,null,"ANTIOQUIA",0,{"$f":"Tabla_territorialidad[[#This Row],[NO]]/2","v":0},0,null,2,"Probable",0.64190843527307251,0.54793467859099132,null,"Sentencia primera instancia - desfavorable"]
["Jurisdicción_Ordinaria_Laboral","Sentencia segunda instancia",0,0,0,null,"CUMPLIMIENTO","CALIDAD DE SERVICIO",{"$f":"Estructura[[#This Row],[RAMO SFC]]&\"-\"&Estructura[[#This Row],[COBERTURA]]","v":"CUMPLIMIENTO-CALIDAD DE SERVICIO"},null,null,null,null,"Fallo fiscal I - desfavorable",0,0,-1.5,-2,null,"Sentencia segunda instancia - favorable",4,{"$f":"Tabla_Jurisd_Ord_Laboral[[#This Row],[NO]]*0.6","v":2.4},4,null,"Sentencia segunda instancia - favorable",4,{"$f":"Tabla_Proces_Coact[[#This Row],[NO]]*0.6","v":3},5,null,"Sentencia segunda instancia - favorable",4,{"$f":"Tabla_Proces_Coact[[#This Row],[NO]]*0.6","v":3},5,null,null,null,null,null,null,"Recurso apelación - favorable",4,{"$f":"Tabla_Proces_Coact[[#This Row],[NO]]*0.6","v":3},5,null,"Sentencia segunda instancia - favorable",4,{"$f":"Tabla_Proces_Coact[[#This Row],[NO]]*0.6","v":3},5,null,"Sentencia segunda instancia - favorable",4,{"$f":"Tabla_Proces_Coact[[#This Row],[NO]]*0.6","v":3},5,null,"Sentencia segunda instancia - favorable",4,{"$f":"Tabla_Jurisd_Ord_Laboral[[#This Row],[NO]]*0.6","v":2.4},5,null,"Sentencia segunda instancia - favorable",4,{"$f":"Tabla_Jurisd_Ord_Laboral[[#This Row],[NO]]*0.6","v":2.4},4,null,"Sentencia segunda instancia - favorable",4,{"$f":"Tabla_Jurisd_Ord_Laboral[[#This Row],[NO]]*0.6","v":2.4},4,null,null,null,null,"Ausente o insolvente",-0.25,null,null,null,null,"ARAUCA",0,{"$f":"Tabla_territorialidad[[#This Row],[NO]]/2","v":0.5},1,null,3,"Eventual",0.29515184479707379,0.34220786990275265,null,"Sentencia segunda instancia - desfavorable"]
["Proceso_Coactivo","Fallo coactivo",0,0,0,null,"CUMPLIMIENTO","CALIDAD DE SUMINISTRO",{"$f":"Estructura[[#This Row],[RAMO SFC]]&\"-\"&Estructura[[#This Row],[COBERTURA]]","v":"CUMPLIMIENTO-CALIDAD DE SUMINISTRO"},null,null,null,null,"Fallo fiscal II - favorable",4,4,{"$f":"Tabla_Resp_Fiscal[[#This Row],[NO]]*0.6","v":2.4},4,null,"Sentencia segunda instancia - desfavorable",0,{"$f":"Tabla_Jurisd_Ord_Laboral[[#This Row],[NO]]*0.6","v":-2.4},-4,null,"Sentencia segunda instancia - desfavorable",0,{"$f":"Tabla_Proces_Coact[[#This Row],[NO]]*0.6","v":-3},-5,null,"Sentencia segunda instancia - desfavorable",0,{"$f":"Tabla_Proces_Coact[[#This Row],[NO]]*0.6","v":-3},-5,null,null,null,null,null,null,"Recurso apelación - desfavorable",0,{"$f":"Tabla_Proces_Coact[[#This Row],[NO]]*0.6","v":-3},-5,null,"Sentencia segunda instancia - desfavorable",0,{"$f":"Tabla_Proces_Coact[[#This Row],[NO]]*0.6","v":-3},-5,null,"Sentencia segunda instancia - desfavorable",0,{"$f":"Tabla_Proces_Coact[[#This Row],[NO]]*0.6","v":-3},-5,null,"Sentencia segunda instancia - desfavorable",0,{"$f":"Tabla_Jurisd_Ord_Laboral[[#This Row],[NO]]*0.6","v":-2.4},-5,null,"Sentencia segunda instancia - desfavorable",0,{"$f":"Tabla_Jurisd_Ord_Laboral[[#This Row],[NO]]*0.6","v":-2.4},-4,null,"Sentencia segunda instancia - desfavorable",0,-2,-4,null,null,null,null,null,null,null,null,null,null,"ATLANTICO",0,{"$f":"Tabla_territorialidad[[#This Row],[NO]]/2","v":0},0,null,4,"Eventual",0.19822135924261003,0.25957111988946258,null,"Sentencia casación - desfavorable"]
["Proceso_Contractual","Sentencia segunda instancia",-0.25,-0.5,-1,null,"CUMPLIMIENTO","CAUCION JUDICIAL",{"$f":"Estructura[[#This Row],[RAMO SFC]]&\"-\"&Estructura[[#This Row],[COBERTURA]]","v":"CUMPLIMIENTO-CAUCION JUDICIAL"},null,null,null,null,"Fallo fiscal II - desfavorable",0,0,{"$f":"Tabla_Resp_Fiscal[[#This Row],[NO]]*0.6","v":-2.4},-4,null,"Sentencia casación - favorable",4,{"$f":"Tabla_Jurisd_Ord_Laboral[[#This Row],[NO]]*0.6","v":3},5,null,null,null,null,null,null,null,null,null,null,null,null,null,null,null,null,null,null,null,null,null,null,null,null,null,null,null,null,null,null,null,null,null,null,null,null,"Sentencia casación - favorable",4,{"$f":"Tabla_Jurisd_Ord_Laboral[[#This Row],[NO]]*0.6","v":3},5,null,"Sentencia casación - favorable",4,{"$f":"Tabla_Jurisd_Ord_Laboral[[#This Row],[NO]]*0.6","v":3},5,null,null,null,null,null,null,null,null,null,null,"BOGOTA",0,{"$f":"Tabla_territorialidad[[#This Row],[NO]]/2","v":0},0,null,5,"Eventual",0.10982228847403006,0.1803694079717629,null,"Laudo arbitral - desfavorable"]
{"$rows_left_out":31}
{"sheet":"Intereses","index":3,"n_rows":296,"n_cols":7,"rows_kept":296,"cut":false,"hidden":true,"merged":[]}
["Desde","Hasta","TIB corriente (%EA) por SFC","Tasa Legal Usura (%EA)","Número Dias","TIB corriente (%EM)","Tasa Legal Usura (%EM)"]
["1997-09-01","1997-09-30",0.31840000000000002,0.47760000000000002,30,{"$f":"(1+Intereses[[#This Row],[TIB corriente (%EA) por SFC]])^(1/12)-1","v":2.330225900940297E-2},{"$f":"(1+Intereses[[#This Row],[Tasa Legal Usura (%EA)]])^(1/12)-1","v":3.3069976778820731E-2}]
["1997-10-01","1997-10-31",0.31330000000000002,0.46989999999999998,31,{"$f":"(1+Intereses[[#This Row],[TIB corriente (%EA) por SFC]])^(1/12)-1","v":2.2971800539050236E-2},{"$f":"(1+Intereses[[#This Row],[Tasa Legal Usura (%EA)]])^(1/12)-1","v":3.2620277856205915E-2}]
["1997-11-01","1997-11-30",0.31469999999999998,0.47204999999999997,30,{"$f":"(1+Intereses[[#This Row],[TIB corriente (%EA) por SFC]])^(1/12)-1","v":2.3062631604311878E-2},{"$f":"(1+Intereses[[#This Row],[Tasa Legal Usura (%EA)]])^(1/12)-1","v":3.2746060030486523E-2}]
["1997-12-01","1997-12-31",0.31740000000000002,0.47610000000000002,31,{"$f":"(1+Intereses[[#This Row],[TIB corriente (%EA) por SFC]])^(1/12)-1","v":2.3237555696297152E-2},{"$f":"(1+Intereses[[#This Row],[Tasa Legal Usura (%EA)]])^(1/12)-1","v":3.2982541837264678E-2}]
["1998-01-01","1998-01-31",0.31690000000000002,0.47535000000000005,31,{"$f":"(1+Intereses[[#This Row],[TIB corriente (%EA) por SFC]])^(1/12)-1","v":2.3205187154887286E-2},{"$f":"(1+Intereses[[#This Row],[Tasa Legal Usura (%EA)]])^(1/12)-1","v":3.2938793819768719E-2}]
["1998-02-01","1998-02-28",0.3256,0.4884,28,{"$f":"(1+Intereses[[#This Row],[TIB corriente (%EA) por SFC]])^(1/12)-1","v":2.3766799270340089E-2},{"$f":"(1+Intereses[[#This Row],[Tasa Legal Usura (%EA)]])^(1/12)-1","v":3.3697117219970041E-2}]
["1998-03-01","1998-03-31",0.32150000000000001,0.48225000000000001,31,{"$f":"(1+Intereses[[#This Row],[TIB corriente (%EA) por SFC]])^(1/12)-1","v":2.3502553774858104E-2},{"$f":"(1+Intereses[[#This Row],[Tasa Legal Usura (%EA)]])^(1/12)-1","v":3.3340508973839222E-2}]
{"$rows_left_out":288}